4 ms·After 30 minutes all i can say is Build failed [sqlite3]: 1 npm ERR! weird error 1 npm ERR! not ok code 0by madradavid 13y agoAfter 30 minutes all i can say is Build failed [sqlite3]: 1 npm ERR! weird error 1 npm ERR! not ok code 0